Target
Polyunsaturated fatty acid lipoxygenase ALOX15
Ligand
BDBM469061
Substrate
Meas. Tech.
LOX Enzyme Activity Assay
IC50
910±n/a nM
Citation
 Springer, CMarais, RNiculescu-Duvaz, DLeung, LSmithen, DCallens, CTang, H Methylamine derivatives as lysysl oxidase inhibitors for the treatment of cancer US Patent  US11608330 Publication Date 3/21/2023 
Target
Name:
Polyunsaturated fatty acid lipoxygenase ALOX15
Synonyms:
12-LOX 15-LOX Arachidonate 12-lipoxygenase Arachidonate omega-6 lipoxygenase LOX15_PIG
Type:
PROTEIN
Mol. Mass.:
74999.86
Organism:
Sus scrofa
Description:
ChEMBL_1510008
Residue:
663
  
Inhibitor
Name:
BDBM469061
Synonyms:
US10807974, Example 84 US11608330, Example 84
Type:
Small organic molecule
Emp. Form.:
C18H16FNO4S3
Mol. Mass.:
425.517
SMILES:
CS(=O)(=O)c1ccc(cc1-c1ccc(F)cc1)S(=O)(=O)c1ccc(CN)s1
: