Target
Cyclin-dependent kinase 3/G1/S-specific cyclin-E1
Ligand
BDBM601946
Substrate
Meas. Tech.
CDK Inhibition In Vitro Assay
IC50
13.0±n/a nM
Citation
 Strum, JC Substituted 1′,2′-dihydro-3′H-spiro[cyclohexane-1,4′-pyrimido[5′,4′:4,5]pyrrolo[2,1-c][1,2,4]triazin]-3′-ones as cyclin-dependent kinase inhibitors US Patent  US11643416 Publication Date 5/9/2023 
Target
Name:
Cyclin-dependent kinase 3/G1/S-specific cyclin-E1
Synonyms:
CDK3/Cyclin E | CDK3/E
Type:
Protein
Mol. Mass.:
Description:
Components:
This complex has 2 components.
Component 1
Name:
Cyclin-dependent kinase 3
Synonyms:
CDK3 CDK3_HUMAN Cyclin-dependent kinase 3 | Cyclin-dependent kinase 3 (CDK3)
Type:
Enzyme
Mol. Mass.:
35053.88
Organism:
Homo sapiens (Human)
Description:
Q00526
Residue:
305
  
Component 2
Name:
G1/S-specific cyclin-E1
Synonyms:
CCNE CCNE1_HUMAN
Type:
Enzyme Subunit
Mol. Mass.:
47073.17
Organism:
Homo sapiens (Human)
Description:
Residue:
410
  
Inhibitor
Name:
BDBM601946
Synonyms:
4-((1',3'-dimethyl-1'H- spiro[cyclohexane-1,4'- pyrimido[5',4':4,5]pyrrolo[2,1- c][1,2,4]triazin]-7'- yl)amino)benzenesulfonamide | US11643416, Compound 46
Type:
Small organic molecule
Emp. Form.:
C21H25N7O2S
Mol. Mass.:
439.534
SMILES:
CN1N=C(C)C2(CCCCC2)n2c1cc1cnc(Nc3ccc(cc3)S(N)(=O)=O)nc21
: