Target
Cyclin-dependent kinase 3/G1/S-specific cyclin-E1
Ligand
BDBM601956
Substrate
Meas. Tech.
CDK Inhibition In Vitro Assay
IC50
187±n/a nM
Citation
 Strum, JC Substituted 1′,2′-dihydro-3′H-spiro[cyclohexane-1,4′-pyrimido[5′,4′:4,5]pyrrolo[2,1-c][1,2,4]triazin]-3′-ones as cyclin-dependent kinase inhibitors US Patent  US11643416 Publication Date 5/9/2023 
Target
Name:
Cyclin-dependent kinase 3/G1/S-specific cyclin-E1
Synonyms:
CDK3/Cyclin E | CDK3/E
Type:
Protein
Mol. Mass.:
Description:
Components:
This complex has 2 components.
Component 1
Name:
Cyclin-dependent kinase 3
Synonyms:
CDK3 CDK3_HUMAN Cyclin-dependent kinase 3 | Cyclin-dependent kinase 3 (CDK3)
Type:
Enzyme
Mol. Mass.:
35053.88
Organism:
Homo sapiens (Human)
Description:
Q00526
Residue:
305
  
Component 2
Name:
G1/S-specific cyclin-E1
Synonyms:
CCNE CCNE1_HUMAN
Type:
Enzyme Subunit
Mol. Mass.:
47073.17
Organism:
Homo sapiens (Human)
Description:
Residue:
410
  
Inhibitor
Name:
BDBM601956
Synonyms:
N,N-dimethyl-4-((3'-oxo-2',3'- dihydro-1'H-spiro[cyclohexane-1,4'- pyrimido[5',4':4,5]pyrrolo[2,1- c][1,2,4]triazin]-7'- yl)amino)benzamide | US11643416, Compound 62
Type:
Small organic molecule
Emp. Form.:
C22H25N7O2
Mol. Mass.:
419.4796
SMILES:
CN(C)C(=O)c1ccc(Nc2ncc3cc4NNC(=O)C5(CCCCC5)n4c3n2)cc1
: