Target
Retinol-binding protein 4
Ligand
BDBM249468
Substrate
Meas. Tech.
SPA Binding Assay
IC50
8.31±n/a nM
Citation
 Petrukhin, KCioffi, CJohnson, GAllikmets, RFreeman, EChen, PConlon, MZhu, L Substituted 4-phenylpiperidines, their preparation and use US Patent  US11649240 Publication Date 5/16/2023 
Target
Name:
Retinol-binding protein 4
Synonyms:
PRBP RBP RET4_HUMAN Retinol-binding protein 4 (RBP4) | spa binding assay for rbp4
Type:
Protein
Mol. Mass.:
23008.75
Organism:
Homo sapiens (Human)
Description:
P02753
Residue:
201
  
Inhibitor
Name:
BDBM249468
Synonyms:
US10072016, Compound 67 US10913746, Compound 67 US9434727, 67 | US9777010, Compound 67
Type:
Small organic molecule
Emp. Form.:
C21H24F4N4O
Mol. Mass.:
424.4351
SMILES:
CCN1CCc2[nH]nc(C(=O)N3CCC(CC3)c3cccc(F)c3C(F)(F)F)c2C1
: