Target
Fatty-acid amide hydrolase 1
Ligand
BDBM483684
Substrate
Meas. Tech.
In Vitro Competitive Activity-Based Protein Assay
IC50
550±n/a nM
Citation
 Grice, CAWiener, JJWeber, ODDuncan, KK Pyrazole MAGL inhibitors US Patent  US11655217 Publication Date 5/23/2023 
Target
Name:
Fatty-acid amide hydrolase 1
Synonyms:
Anandamide amidohydrolase FAAH FAAH1_HUMAN Fatty-acid amide hydrolase (FAAH) Oleamide hydrolase 1
Type:
Protein
Mol. Mass.:
63071.19
Organism:
Homo sapiens (Human)
Description:
O00519
Residue:
579
  
Inhibitor
Name:
BDBM483684
Synonyms:
1-(4-(3-(4- chlorophenoxy)- benzyl)- piperazine-1- carbonyl)-4-methyl- 1H-pyrazole-3- carboxylic acid US11655217, Example 129
Type:
Small organic molecule
Emp. Form.:
C23H23ClN4O4
Mol. Mass.:
454.906
SMILES:
Cc1cn(nc1C(O)=O)C(=O)N1CCN(Cc2cccc(Oc3ccc(Cl)cc3)c2)CC1
: