Target
Tyrosine-protein kinase ITK/TSK
Ligand
BDBM50587593
Substrate
Meas. Tech.
ITK Enzyme Assay
IC50
3.00±n/a nM
Citation
 Bagley, SWCasimiro-Garcia, ACheng, XDavoren, JEDenny, RAGerstenberger, BSLovering, FEParikh, MDStrohbach, JWTrujillo, JI Benzimidazole derivative compounds and uses thereof US Patent  US11661419 Publication Date 5/30/2023 
Target
Name:
Tyrosine-protein kinase ITK/TSK
Synonyms:
EMT ITK_HUMAN LYK Tyrosine-protein kinase ITK Tyrosine-protein kinase Lyk
Type:
Protein
Mol. Mass.:
71839.20
Organism:
Homo sapiens (Human)
Description:
Q08881
Residue:
620
  
Inhibitor
Name:
BDBM50587593
Synonyms:
CHEMBL5088468 US20230280220, Example 11
Type:
Small organic molecule
Emp. Form.:
C24H27F2N5O2
Mol. Mass.:
455.5003
SMILES:
[H][C@@]12C[C@]1(C)Cc1[nH]nc(c1C2)-c1nc2cc(ccc2[nH]1)N(C)C(=O)C(F)(F)C1CCOCC1
: