Target
Tyrosine-protein kinase ITK/TSK
Ligand
BDBM604265
Substrate
Meas. Tech.
ITK Enzyme Assay
IC50
3.00±n/a nM
Citation
 Bagley, SWCasimiro-Garcia, ACheng, XDavoren, JEDenny, RAGerstenberger, BSLovering, FEParikh, MDStrohbach, JWTrujillo, JI Benzimidazole derivative compounds and uses thereof US Patent  US11661419 Publication Date 5/30/2023 
Target
Name:
Tyrosine-protein kinase ITK/TSK
Synonyms:
EMT ITK_HUMAN LYK Tyrosine-protein kinase ITK Tyrosine-protein kinase Lyk
Type:
Protein
Mol. Mass.:
71839.20
Organism:
Homo sapiens (Human)
Description:
Q08881
Residue:
620
  
Inhibitor
Name:
BDBM604265
Synonyms:
US11661419, Example 14 | US20230280220, Example 14
Type:
Small organic molecule
Emp. Form.:
C24H30N6O2
Mol. Mass.:
434.534
SMILES:
C[C@H](N1CCOCC1)C(=O)N(C)c1ccc2[nH]c(nc2c1)-c1n[nH]c2C[C@@]3(C)C[C@H]3Cc12
: