Target
Ataxin-1
Ligand
BDBM477058
Substrate
Meas. Tech.
Human ATX Enzyme Inhibition Assay
IC50
1.000±n/a nM
Citation
 Hert, JHunziker, DMattei, PRudolph, MSchmitz, PDi Giorgio, P Bicyclic compounds as ATX inhibitors US Patent  US11673888 Publication Date 6/13/2023 
Target
Name:
Ataxin-1
Synonyms:
ATX1 ATXN1 | SCA1
Type:
Protein
Mol. Mass.:
86941.25
Organism:
Homo sapiens (Human)
Description:
P54253
Residue:
815
  
Inhibitor
Name:
BDBM477058
Synonyms:
US10882857, Example 2.06 | US11673888, Example 2.06
Type:
Small organic molecule
Emp. Form.:
C24H29F3N6O7S
Mol. Mass.:
602.583
SMILES:
CC(C)(C)C(=O)Nc1cc(cnc1COC(=O)N1Cc2nc(oc2C1)C(=O)N1CCC(CC1)S(N)(=O)=O)C(F)(F)F
: