Target
Ataxin-1
Ligand
BDBM477064
Substrate
Meas. Tech.
Human ATX Enzyme Inhibition Assay
IC50
1.000±n/a nM
Citation
 Hert, JHunziker, DMattei, PRudolph, MSchmitz, PDi Giorgio, P Bicyclic compounds as ATX inhibitors US Patent  US11673888 Publication Date 6/13/2023 
Target
Name:
Ataxin-1
Synonyms:
ATX1 ATXN1 | SCA1
Type:
Protein
Mol. Mass.:
86941.25
Organism:
Homo sapiens (Human)
Description:
P54253
Residue:
815
  
Inhibitor
Name:
BDBM477064
Synonyms:
US10882857, Example 4.02 [3-(2,2-Dimethylpropanoylamino)-5-(trifluoromethyl)pyridin-2-yl]methyl 2-(4-sulfamoylpiperidine-1-carbonyl)-4,6-dihydrothieno[2,3-c]pyrrole-5-carboxylate and 2,2-dimethyl-N-[2-[[2-(4-sulfamoylpiperidine-1-carbonyl)-4,6-dihydrothieno[2,3-c]pyrrol-5-yl]methyl]-5-(trifluoromethyl)pyridin-3-yl]propanamide
Type:
Small organic molecule
Emp. Form.:
C25H30F3N5O6S2
Mol. Mass.:
617.661
SMILES:
CC(C)(C)C(=O)Nc1cc(cnc1COC(=O)N1Cc2cc(sc2C1)C(=O)N1CCC(CC1)S(N)(=O)=O)C(F)(F)F
: