Target
cAMP-specific 3',5'-cyclic phosphodiesterase 7B
Ligand
BDBM607114
Substrate
Meas. Tech.
Enzymatic Assay
IC50
<10.00±n/a nM
Citation
 Santora, VJChen, MChung, D Substituted benzoxazole and benzofuran compounds as PDE7 inhibitors US Patent  US11685745 Publication Date 6/27/2023 
Target
Name:
cAMP-specific 3',5'-cyclic phosphodiesterase 7B
Synonyms:
3',5'-cyclic phosphodiesterase PDE7B_HUMAN Phosphodiesterase 7B (PDE7B) | cAMP-specific 3',5'-cyclic phosphodiesterase 7B
Type:
Enzyme
Mol. Mass.:
51842.76
Organism:
Homo sapiens (Human)
Description:
Q9NP56
Residue:
450
  
Inhibitor
Name:
BDBM607114
Synonyms:
US11685745, Example 332
Type:
Small organic molecule
Emp. Form.:
C24H21ClN4O3
Mol. Mass.:
448.902
SMILES:
Clc1cc2cc(oc2c2c1NC(=O)NC21CCCCC1)C(=O)NCc1ccc(cc1)C#N
: