Target
cAMP-specific 3',5'-cyclic phosphodiesterase 7B
Ligand
BDBM607135
Substrate
Meas. Tech.
Enzymatic Assay
IC50
55.0±n/a nM
Citation
 Santora, VJChen, MChung, D Substituted benzoxazole and benzofuran compounds as PDE7 inhibitors US Patent  US11685745 Publication Date 6/27/2023 
Target
Name:
cAMP-specific 3',5'-cyclic phosphodiesterase 7B
Synonyms:
3',5'-cyclic phosphodiesterase PDE7B_HUMAN Phosphodiesterase 7B (PDE7B) | cAMP-specific 3',5'-cyclic phosphodiesterase 7B
Type:
Enzyme
Mol. Mass.:
51842.76
Organism:
Homo sapiens (Human)
Description:
Q9NP56
Residue:
450
  
Inhibitor
Name:
BDBM607135
Synonyms:
US11685745, Example 21
Type:
Small organic molecule
Emp. Form.:
C17H20ClN3O3
Mol. Mass.:
349.812
SMILES:
COCCc1nc2cc(Cl)c3NC(=O)NC4(CCCCC4)c3c2o1
: