Target
Dimer of Gag-Pol polyprotein [501-599,Q508K,L534I,L564I,C568A,C596A]
Ligand
BDBM9178
Substrate
HIV Protease substrate
Meas. Tech.
Protease Inhibition Assay
Ki
0.005±n/a nM
IC50
11±n/a nM
Citation
 Sherrill, RGFurfine, ESHazen, RJMiller, JFReynolds, DJSammond, DMSpaltenstein, AWheelan, PWright, LL Synthesis and antiviral activities of novel N-alkoxy-arylsulfonamide-based HIV protease inhibitors. Bioorg Med Chem Lett 15:3560-4 (2005)  
Target
Name:
Dimer of Gag-Pol polyprotein [501-599,Q508K,L534I,L564I,C568A,C596A]
Synonyms:
HIV-1 Protease
Type:
Protein Complex
Mol. Mass.:
Description:
Components:
This complex has 2 components.
Component 1
Name:
Gag-Pol polyprotein [501-599,Q508K,L534I,L564I,C568A,C596A]
Synonyms:
HIV-1 Protease chain A gag-pol
Type:
Enzyme Subunit
Mol. Mass.:
10732.11
Organism:
Human immunodeficiency virus type 1
Description:
The HIV-1 protease (Genbank HIVHXB2CG) clone was constructed with the substitutions Q7K, L33I, and L63I, to minimize the autoproteolysis of the protease, and C67A and C95A, to prevent cysteine-thiol oxidation.
Residue:
99
  
Component 2
Name:
Gag-Pol polyprotein [501-599,Q508K,L534I,L564I,C568A,C596A]
Synonyms:
HIV-1 Protease chain A gag-pol
Type:
Enzyme Subunit
Mol. Mass.:
10732.11
Organism:
Human immunodeficiency virus type 1
Description:
The HIV-1 protease (Genbank HIVHXB2CG) clone was constructed with the substitutions Q7K, L33I, and L63I, to minimize the autoproteolysis of the protease, and C67A and C95A, to prevent cysteine-thiol oxidation.
Residue:
99
  
Inhibitor
Name:
BDBM9178
Synonyms:
(3R,3aS,6aR)-hexahydrofuro[2,3-b]furan-3-yl N-[(2S,3R)-4-[(3-aminobenzene)(cyclohexyloxy)sulfonamido]-3-hydroxy-1-phenylbutan-2-yl]carbamate N-alkoxysulfonamide analog entry r
Type:
Small organic molecule
Emp. Form.:
C29H39N3O8S
Mol. Mass.:
589.7
SMILES:
[H][C@@]12CCO[C@]1([H])OC[C@@H]2OC(=O)N[C@@H](Cc1ccccc1)[C@H](O)CN(OC1CCCCC1)S(=O)(=O)c1cccc(N)c1
:
Substrate
Name:
HIV Protease substrate
Synonyms:
Fluorogenic Peptide Substrate
Type:
Peptide
Mol. Mass.:
3467.28
Organism:
Description:
Residue:
30