Target
15-hydroxyprostaglandin dehydrogenase [NAD(+)]
Ligand
BDBM50607641
Substrate
Meas. Tech.
In Vitro Assay
IC50
1.60±n/a nM
Citation
 Markowitz, SYuan, YZhang, YReady, JHu, B Compositions and methods of modulating short-chain dehydrogenase US Patent  US11718589 Publication Date 8/8/2023 
Target
Name:
15-hydroxyprostaglandin dehydrogenase [NAD(+)]
Synonyms:
15-PGDH HPGD PGDH_HUMAN SDR36C1
Type:
Enzyme
Mol. Mass.:
28974.46
Organism:
Homo sapiens (Human)
Description:
P15428
Residue:
266
  
Inhibitor
Name:
BDBM50607641
Synonyms:
CHEMBL5220078 | US11718589, Compound 59b
Type:
Small organic molecule
Emp. Form.:
C18H18N6O
Mol. Mass.:
334.3751
SMILES:
Nc1ncc(cn1)-c1cnc2ccc(cc2n1)C(=O)N1CCCCC1
: