Target
Tyrosine-protein kinase ITK/TSK
Ligand
BDBM604255
Substrate
Meas. Tech.
ITK Enzyme Assay
IC50
3.00±n/a nM
Citation
 Bagley, SWCasimiro Garcia, ACheng, XDavoren, JEDenny, RAGerstenberger, BSLovering, FEParikh, MDStrohbach, JWTrujillo, JI Benzimidazole Derivative Compounds and Uses Thereof US Patent  US20230280220 Publication Date 9/7/2023 
Target
Name:
Tyrosine-protein kinase ITK/TSK
Synonyms:
EMT ITK_HUMAN LYK Tyrosine-protein kinase ITK Tyrosine-protein kinase Lyk
Type:
Protein
Mol. Mass.:
71839.20
Organism:
Homo sapiens (Human)
Description:
Q08881
Residue:
620
  
Inhibitor
Name:
BDBM604255
Synonyms:
US11661419, Example 4 | US20230280220, Example 4
Type:
Small organic molecule
Emp. Form.:
C26H33N5O2
Mol. Mass.:
447.5725
SMILES:
C[C@H](C1CCOCC1)C(=O)N(C)c1cc2nc([nH]c2cc1C)-c1n[nH]c2C[C@@]3(C)C[C@H]3Cc12
: