Target
Glutamate receptor ionotropic, NMDA 2B
Ligand
BDBM617021
Substrate
Meas. Tech.
NR2B Antagonist Activity
Ki
2.55±n/a nM
Citation
 Shapiro, GFlood, DG Treatment of autism spectrum disorders, obsessive-compulsive disorder and anxiety disorders US Patent  US11752155 Publication Date 9/12/2023 
Target
Name:
Glutamate receptor ionotropic, NMDA 2B
Synonyms:
GluN2B Grin2b NMDA receptor subunit N2B (GluN2B) NMDE2_RAT | NR2B
Type:
Protein
Mol. Mass.:
166077.66
Organism:
Rattus norvegicus (Rat)
Description:
Q00960
Residue:
1482
  
Inhibitor
Name:
BDBM617021
Synonyms:
US11752155, Compound E1-1.5B'
Type:
Small organic molecule
Emp. Form.:
C21H24F2N6O2
Mol. Mass.:
430.4511
SMILES:
CCc1ccc(COC(=O)N2CC[C@H](CNc3nccn4cnnc34)C(F)(F)C2)cc1
: