Target
Integrin alpha-V/beta-6
Ligand
BDBM465214
Substrate
Meas. Tech.
Solid Phase Integrin alphaVbeta6 Binding Assay
IC50
625±n/a nM
Citation
 LEFEBVRE, ECOSGROVE, GP INTEGRIN INHIBITORS AND USES THEREOF IN COMBINATION WITH OTHER AGENTS US Patent  US20230293519 Publication Date 9/21/2023 
Target
Name:
Integrin alpha-V/beta-6
Synonyms:
ITGAV/ITGB6 Integrin alpha-v/beata-6 Integrin beta-6/Vitronectin receptor alpha
Type:
Enzyme
Mol. Mass.:
Description:
Components:
This complex has 2 components.
Component 1
Name:
Integrin alpha-V
Synonyms:
ITAV_HUMAN Integrin alpha-V/alpha-5 VNRA Vitronectin receptor | Vitronectin receptor subunit alpha
Type:
PROTEIN
Mol. Mass.:
116024.92
Organism:
Homo sapiens (Human)
Description:
ChEMBL_582336
Residue:
1048
  
Component 2
Name:
Integrin beta-6
Synonyms:
ITB6_HUMAN | ITGB6
Type:
PROTEIN
Mol. Mass.:
85919.61
Organism:
Homo sapiens (Human)
Description:
EBI_10916
Residue:
788
  
Inhibitor
Name:
BDBM465214
Synonyms:
US10793564, Compound 2 US11560376, Compound 2 US20230293519, Compound 2
Type:
Small organic molecule
Emp. Form.:
C23H32N6O2
Mol. Mass.:
424.5392
SMILES:
OC(=O)[C@H](CCN(CCCCc1ccc2CCCNc2n1)C1CC1)Nc1ccncn1
: