Target
Dual specificity tyrosine-phosphorylation-regulated kinase 2
Ligand
BDBM621046
Substrate
Meas. Tech.
DYRK2 Kinase Activity Analysis and Detection Method
IC50
27.0±n/a nM
Citation
 YANG, PHAO, HXIAO, YYUAN, KWANG, XKUANG, W CDK6/DYRK2 DUAL-TARGET INHIBITOR, AND PREPARATION METHOD THEREFOR AND USE THEREOF US Patent  US20230303553 Publication Date 9/28/2023 
Target
Name:
Dual specificity tyrosine-phosphorylation-regulated kinase 2
Synonyms:
DYRK2 Dual-specificity tyrosine-phosphorylation regulated kinase 2
Type:
PROTEIN
Mol. Mass.:
66690.69
Organism:
Homo sapiens (Human)
Description:
ChEMBL_1508025
Residue:
601
  
Inhibitor
Name:
BDBM621046
Synonyms:
(6-((5-fluoro-4-(2-methylbenzothiazole-6-yl)pyrimidine-2-yl)amino)pyridine-3-yl)(piperazine-1-yl)ketone hydrochloride | US20230303553, Example 17
Type:
Small organic molecule
Emp. Form.:
C22H20FN7OS
Mol. Mass.:
449.504
SMILES:
Cc1nc2ccc(cc2s1)-c1nc(Nc2ccc(cn2)C(=O)N2CCNCC2)ncc1F
: