Target
Receptor-type tyrosine-protein kinase FLT3 [N841I]
Ligand
BDBM621161
Substrate
Meas. Tech.
Kinase Binding Assay
Kd
0.910±n/a nM
Citation
 HOYT, SBTHOMAS, CJFINOCCHIO, CJSTARCZYNOWSKI, DTTAWA, GJGRACIA MALDONADO, GROSEBAUM, JS MULTI-CYCLIC IRAK AND FLT3 INHIBITING COMPOUNDS AND USES THEREOF US Patent  US20230303563 Publication Date 9/28/2023 
Target
Name:
Receptor-type tyrosine-protein kinase FLT3 [N841I]
Synonyms:
CD135 FLT3 Receptor-type tyrosine-protein kinase FLT3 (N841I) Tyrosine Kinase FLT3 Mutant (N841I)
Type:
Tyrosine-protein kinase
Mol. Mass.:
112887.67
Organism:
Homo sapiens (Human)
Description:
gi_121114304
Residue:
993
  
Inhibitor
Name:
BDBM621161
Synonyms:
N-((3S,4S)-4- fluoropyrrolidin-3-yl)-6-(7- isopropoxyimidazo[1,2- a]pyridin-3-yl)pyridin-2- amine | US20230303563, Compound 261
Type:
Small organic molecule
Emp. Form.:
C19H22FN5O
Mol. Mass.:
355.4093
SMILES:
CC(C)Oc1ccn2c(cnc2c1)-c1cccc(N[C@H]2CNC[C@@H]2F)n1
: