Target
Ataxin-1
Ligand
BDBM622503
Substrate
Meas. Tech.
Autotaxin (ATX) Enzymatic Activity Inhibition Assay
IC50
1.59±n/a nM
Citation
 Zhang, XYue, YLei, SXia, QLi, YYang, QLiu, MYang, SLiu, MHu, BZhang, SDing, XLiu, Z Salts Of Nitrogen-Containing Heterocyclic Compound, And Solid Forms Of Salts, Pharmaceutical Composition And Use Thereof US Patent  US20230312582 Publication Date 10/5/2023 
Target
Name:
Ataxin-1
Synonyms:
ATX1 ATXN1 | SCA1
Type:
Protein
Mol. Mass.:
86941.25
Organism:
Homo sapiens (Human)
Description:
P54253
Residue:
815
  
Inhibitor
Name:
BDBM622503
Synonyms:
US20230312582, Example Compound Formula (I)
Type:
Small organic molecule
Emp. Form.:
C22H25N7O2
Mol. Mass.:
419.4796
SMILES:
C[C@H](Cc1cnn[nH]1)OCC(=O)N1Cc2cnc(NC3Cc4ccccc4C3)nc2C1
: