Target
Replicase polyprotein 1ab
Ligand
BDBM429304
Substrate
Meas. Tech.
Fluorescence Mpro inhibition assay (S1)
IC50
50±n/a nM
Citation
Some error occurs, please report
Target
Name:
Replicase polyprotein 1ab
Synonyms:
ORF1ab polyprotein pp1ab | rep
Type:
Protein
Mol. Mass.:
794070.71
Organism:
2019-nCoV
Description:
P0DTD1
Residue:
7096
  
Inhibitor
Name:
BDBM429304
Synonyms:
CVD-0006354 indole chloropyridinyl-ester derived, 1 | jm5b01461, Compound 124
Type:
Small Organic Molecule
Emp. Form.:
C14H9ClN2O2
Mol. Mass.:
272.686
SMILES:
Clc1cncc(OC(=O)c2cccc3[nH]ccc23)c1
: