Target
Lysosomal alpha-glucosidase
Ligand
BDBM50124581
Substrate
Meas. Tech.
Inhibition of rhGAA Determined by Measuring the Residual Activity in the Presence of an Inhibitor in Vitro
IC50
460±n/a nM
Citation
 PY, SKANAZAWA, AVIEIRA DA CRUZ, ATANGARA, S NOVEL PHARMACOLOGICAL CHAPERONE COMPOUNDS OF HUMAN ACID ALPHA-GLUCOSIDASE AND THE THERAPEUTIC USE THEREOF US Patent  US20230339856 Publication Date 10/26/2023 
Target
Name:
Lysosomal alpha-glucosidase
Synonyms:
70 kDa lysosomal alpha-glucosidase Acid maltase Alpha glucosidase LYAG_HUMAN
Type:
PROTEIN
Mol. Mass.:
105312.45
Organism:
Homo sapiens (Human)
Description:
ChEMBL_1506060
Residue:
952
  
Inhibitor
Name:
BDBM50124581
Synonyms:
CHEMBL3621529 | US20230339856, Compound (IIg)
Type:
Small organic molecule
Emp. Form.:
C9H17NO4
Mol. Mass.:
203.2356
SMILES:
OC[C@@]12CCCN1C[C@H](O)[C@@H](O)[C@@H]2O
: