Target
Galectin-1
Ligand
BDBM632523
Substrate
Meas. Tech.
Biological Assay
IC50
356±n/a nM
Citation
 BOLLI, MGATFIELD, JGRISOSTOMI, CREMEN, LSAGER, CZUMBRUNN, C GALECTIN-3 INHIBITING 2-HYDROXYCYCLOALKANE-1-CARBAMOYL DERIVATIVES US Patent  US20230348442 Publication Date 11/2/2023 
Target
Name:
Galectin-1
Synonyms:
14 kDa lectin HPL LGALS1 Lectin galactoside-binding soluble 1 | Putative MAPK-activating protein PM12
Type:
beta galactoside-binding protein
Mol. Mass.:
14713.53
Organism:
Homo sapiens (Human)
Description:
P09382
Residue:
135
  
Inhibitor
Name:
BDBM632523
Synonyms:
(2R,3R,4S,5R,6R)-N-(3-bromo-5-cyanophenyl)-4-(4-(3-fluorophenyl)-1H- 1,2,3-triazol-1-yl)-5-hydroxy-N-((1S,2S)-2-hydroxycyclopentyl)-6- (hydroxymethyl)-3-methoxytetrahydro-2H-pyran-2-carboxamide | US20230348442, Example 1.15.5
Type:
Small organic molecule
Emp. Form.:
C28H29BrFN5O6
Mol. Mass.:
630.462
SMILES:
CO[C@H]1[C@@H](O[C@H](CO)[C@H](O)[C@@H]1n1cc(nn1)-c1cccc(F)c1)C(=O)N([C@H]1CCC[C@@H]1O)c1cc(Br)cc(c1)C#N
: