Target
Cell division cycle 7-related protein kinase
Ligand
BDBM636599
Substrate
Meas. Tech.
CDC7 Kinase Biochemical Assay
IC50
<1±n/a nM
Citation
 HUANG, XMONDAL, SGHANAKOTA, PBOYLES, NFRYE, LLEVINSON, AGREENWOOD, JRBOS, PBHAT, SGERASYUTO, ATANG, H HETEROCYCLIC PERICONDENSED CDC7 KINASE INHIBITORS FOR THE TREATMENT OF CANCER US Patent  US20230365584 Publication Date 11/16/2023 
Target
Name:
Cell division cycle 7-related protein kinase
Synonyms:
CDC7 CDC7L1 Cell division cycle 7-related protein kinase (CDC7) huCdc7
Type:
Protein
Mol. Mass.:
63908.16
Organism:
Homo sapiens (Human)
Description:
O00311
Residue:
574
  
Inhibitor
Name:
BDBM636599
Synonyms:
2-(3-methyl-1H-pyrazol-4-yl)- 7-(pyrazol-1-ylmethyl)-12-oxa-3-thia- 6-azatricyclo [6.4.1.04,13]trideca-1,4(13),7- trien-5-one | US20230365584, Compound 20.
Type:
Small organic molecule
Emp. Form.:
C18H17N5O2S
Mol. Mass.:
367.425
SMILES:
Cc1n[nH]cc1-c1sc2c3c1OCCCc3c(Cn1cccn1)[nH]c2=O
: