Target
Cell division cycle 7-related protein kinase
Ligand
BDBM636627
Substrate
Meas. Tech.
CDC7 Kinase Biochemical Assay
IC50
<1±n/a nM
Citation
 HUANG, XMONDAL, SGHANAKOTA, PBOYLES, NFRYE, LLEVINSON, AGREENWOOD, JRBOS, PBHAT, SGERASYUTO, ATANG, H HETEROCYCLIC PERICONDENSED CDC7 KINASE INHIBITORS FOR THE TREATMENT OF CANCER US Patent  US20230365584 Publication Date 11/16/2023 
Target
Name:
Cell division cycle 7-related protein kinase
Synonyms:
CDC7 CDC7L1 Cell division cycle 7-related protein kinase (CDC7) huCdc7
Type:
Protein
Mol. Mass.:
63908.16
Organism:
Homo sapiens (Human)
Description:
O00311
Residue:
574
  
Inhibitor
Name:
BDBM636627
Synonyms:
2-(1H-pyrazol-4-yl)-7-[1- (triazol-2-yl)ethyl]-12-oxa-3-thia-6- azatricyclo[6.4.1.04,13]trideca- 1,4(13),7-trien-5-one | US20230365584, Compound 48.
Type:
Small organic molecule
Emp. Form.:
C17H16N6O2S
Mol. Mass.:
368.413
SMILES:
CC(c1[nH]c(=O)c2sc(-c3cn[nH]c3)c3OCCCc1c23)n1nccn1
: