Target
Cell division cycle 7-related protein kinase
Ligand
BDBM636635
Substrate
Meas. Tech.
CDC7 Kinase Biochemical Assay
IC50
<1±n/a nM
Citation
 HUANG, XMONDAL, SGHANAKOTA, PBOYLES, NFRYE, LLEVINSON, AGREENWOOD, JRBOS, PBHAT, SGERASYUTO, ATANG, H HETEROCYCLIC PERICONDENSED CDC7 KINASE INHIBITORS FOR THE TREATMENT OF CANCER US Patent  US20230365584 Publication Date 11/16/2023 
Target
Name:
Cell division cycle 7-related protein kinase
Synonyms:
CDC7 CDC7L1 Cell division cycle 7-related protein kinase (CDC7) huCdc7
Type:
Protein
Mol. Mass.:
63908.16
Organism:
Homo sapiens (Human)
Description:
O00311
Residue:
574
  
Inhibitor
Name:
BDBM636635
Synonyms:
N-methyl-N-(3-oxo-1-(1H- pyrazol-4-yl)-4,6,7,8-tetrahydro-3H- 9-oxa-2-thia-4-azabenzo[cd]azulen- 5-yl)acetamide | US20230365584, Compound 56.
Type:
Small organic molecule
Emp. Form.:
C16H16N4O3S
Mol. Mass.:
344.388
SMILES:
CN(C(C)=O)c1[nH]c(=O)c2sc(-c3cn[nH]c3)c3OCCCc1c23
: