Target
Cell division cycle 7-related protein kinase
Ligand
BDBM636640
Substrate
Meas. Tech.
CDC7 Kinase Biochemical Assay
IC50
<1±n/a nM
Citation
 HUANG, XMONDAL, SGHANAKOTA, PBOYLES, NFRYE, LLEVINSON, AGREENWOOD, JRBOS, PBHAT, SGERASYUTO, ATANG, H HETEROCYCLIC PERICONDENSED CDC7 KINASE INHIBITORS FOR THE TREATMENT OF CANCER US Patent  US20230365584 Publication Date 11/16/2023 
Target
Name:
Cell division cycle 7-related protein kinase
Synonyms:
CDC7 CDC7L1 Cell division cycle 7-related protein kinase (CDC7) huCdc7
Type:
Protein
Mol. Mass.:
63908.16
Organism:
Homo sapiens (Human)
Description:
O00311
Residue:
574
  
Inhibitor
Name:
BDBM636640
Synonyms:
(S)-6-(2-hydroxypropan-2-yl)- 4-methyl-2-(1H-pyrazol-4-yl)-5,7- dihydro-3-oxa-1-thia-7- azaacenaphthylen-8(4H)-one | US20230365584, Compound 61.
Type:
Small organic molecule
Emp. Form.:
C16H17N3O3S
Mol. Mass.:
331.389
SMILES:
C[C@H]1Cc2c([nH]c(=O)c3sc(-c4cn[nH]c4)c(O1)c23)C(C)(C)O
: