Target
Coagulation factor X
Ligand
BDBM639321
Substrate
Meas. Tech.
Enzymatic Activity Assay
IC50
0.490±n/a nM
Citation
Target
Name:
Coagulation factor X
Synonyms:
Activated coagulation factor X (FXa) Coagulation factor X precursor F10 Factor X heavy chain Factor Xa Stuart-Prower factor
Type:
Enzyme
Mol. Mass.:
54726.60
Organism:
Homo sapiens (Human)
Description:
Residue:
488
  
Inhibitor
Name:
BDBM639321
Synonyms:
Methyl 3-{[(5-chloro-2-thienyl)carbonyl]amino}-N-{[2-methyl-3-(2-oxopyrrolidin-1-yl)phenyl]-sulfonyl}-S-alaninate | US20230391761, Reference 4
Type:
Small organic molecule
Emp. Form.:
C20H22ClN3O6S2
Mol. Mass.:
499.988
SMILES:
COC(=O)[C@H](CNC(=O)c1ccc(Cl)s1)NS(=O)(=O)c1cccc(N2CCCC2=O)c1C
: