Target
Coagulation factor X
Ligand
BDBM639340
Substrate
Meas. Tech.
Enzymatic Activity Assay
IC50
0.450±n/a nM
Citation
Target
Name:
Coagulation factor X
Synonyms:
Activated coagulation factor X (FXa) Coagulation factor X precursor F10 Factor X heavy chain Factor Xa Stuart-Prower factor
Type:
Enzyme
Mol. Mass.:
54726.60
Organism:
Homo sapiens (Human)
Description:
Residue:
488
  
Inhibitor
Name:
BDBM639340
Synonyms:
2-(1-Methyl-1H-imidazol-2-yl)ethyl 3-{[(5-chloro-2-thienyl)carbonyl]amino}-N-{[2-methyl-3-(2-oxopyrrolidin-1-yl)phenyl]sulfonyl}-S-alaninate | US20230391761, Reference 8
Type:
Small organic molecule
Emp. Form.:
C25H28ClN5O6S2
Mol. Mass.:
594.103
SMILES:
Cc1c(cccc1S(=O)(=O)N[C@@H](CNC(=O)c1ccc(Cl)s1)C(=O)OCCc1nccn1C)N1CCCC1=O
: