Target
NACHT, LRR and PYD domains-containing protein 3
Ligand
BDBM640742
Substrate
Meas. Tech.
Evaluation of NLRP3 Inflammasome Inhibitory Activity Assay
IC50
11.0±n/a nM
Citation
 OHBA, YFURUKAWA, TADACHI, KNISHIMARU, TSAKURAI, KMASUO, RINAMI, T Acylsulfamide Compound and Pharmaceutical Use Therefor US Patent  US20230399319 Publication Date 12/14/2023 
Target
Name:
NACHT, LRR and PYD domains-containing protein 3
Synonyms:
C1orf7 NALP3 NLRP3 protein PYPAF1
Type:
Enzyme Catalytic Domain
Mol. Mass.:
118173.88
Organism:
Homo sapiens (Human)
Description:
Q96P20
Residue:
1036
  
Inhibitor
Name:
BDBM640742
Synonyms:
US20230399319, Example 2-301
Type:
Small organic molecule
Emp. Form.:
C20H25F3N4O6S
Mol. Mass.:
506.496
SMILES:
CCOCC1CCN(CCO1)S(=O)(=O)NC(=O)c1coc(Nc2cc(ccc2C)C(F)(F)F)n1
: