Target
Bifunctional 3'-5' exonuclease/ATP-dependent helicase WRN [517-1238]
Ligand
BDBM646431
Substrate
Meas. Tech.
In Vitro Enzymatic Activity Assay on WRN Helicase
IC50
60.0±n/a nM
Citation
 Bordas, VBrun, JFuregati, MHamon, JHinrichs, JHHolzer, PLimam, FMöbitz, HNocito, SPlattner, SSchmiedeberg, NSchoepfer, JStrang, RSZecri, F Bicyclic compounds and their uses US Patent  US11878973 Publication Date 1/23/2024 
Target
Name:
Bifunctional 3'-5' exonuclease/ATP-dependent helicase WRN [517-1238]
Synonyms:
Bifunctional 3'-5' exonuclease/ATP-dependent helicase WRN (517-1238)
Type:
Enzyme Catalytic Domain
Mol. Mass.:
81717.91
Organism:
Homo sapiens (Human)
Description:
Q14191[517-1238]
Residue:
722
  
Inhibitor
Name:
BDBM646431
Synonyms:
US11878973, Example 100
Type:
Small organic molecule
Emp. Form.:
C31H34F5N9O5S
Mol. Mass.:
739.716
SMILES:
CCc1c(N2CCN(CC2)C(=O)c2ncnc(C)c2O)c(=O)n2nc(nc2n1CC(=O)Nc1ccc(cc1C)S(F)(F)(F)(F)F)C1=CCOCC1
: