Target
Bifunctional 3'-5' exonuclease/ATP-dependent helicase WRN [517-1238]
Ligand
BDBM646454
Substrate
Meas. Tech.
In Vitro Enzymatic Activity Assay on WRN Helicase
IC50
70.0±n/a nM
Citation
 Bordas, VBrun, JFuregati, MHamon, JHinrichs, JHHolzer, PLimam, FMöbitz, HNocito, SPlattner, SSchmiedeberg, NSchoepfer, JStrang, RSZecri, F Bicyclic compounds and their uses US Patent  US11878973 Publication Date 1/23/2024 
Target
Name:
Bifunctional 3'-5' exonuclease/ATP-dependent helicase WRN [517-1238]
Synonyms:
Bifunctional 3'-5' exonuclease/ATP-dependent helicase WRN (517-1238)
Type:
Enzyme Catalytic Domain
Mol. Mass.:
81717.91
Organism:
Homo sapiens (Human)
Description:
Q14191[517-1238]
Residue:
722
  
Inhibitor
Name:
BDBM646454
Synonyms:
US11878973, Example 48
Type:
Small organic molecule
Emp. Form.:
C30H28ClF4N9O5
Mol. Mass.:
706.047
SMILES:
CCc1c(N2CCN(CC2)C(=O)c2nccc(F)c2O)c(=O)n2nc(nc2n1CC(=O)Nc1ccc(nc1Cl)C(F)(F)F)C1=CCOCC1
: