Target
Bifunctional 3'-5' exonuclease/ATP-dependent helicase WRN [517-1238]
Ligand
BDBM646483
Substrate
Meas. Tech.
In Vitro Enzymatic Activity Assay on WRN Helicase
IC50
60.0±n/a nM
Citation
 Bordas, VBrun, JFuregati, MHamon, JHinrichs, JHHolzer, PLimam, FMöbitz, HNocito, SPlattner, SSchmiedeberg, NSchoepfer, JStrang, RSZecri, F Bicyclic compounds and their uses US Patent  US11878973 Publication Date 1/23/2024 
Target
Name:
Bifunctional 3'-5' exonuclease/ATP-dependent helicase WRN [517-1238]
Synonyms:
Bifunctional 3'-5' exonuclease/ATP-dependent helicase WRN (517-1238)
Type:
Enzyme Catalytic Domain
Mol. Mass.:
81717.91
Organism:
Homo sapiens (Human)
Description:
Q14191[517-1238]
Residue:
722
  
Inhibitor
Name:
BDBM646483
Synonyms:
US11878973, Example 134
Type:
Small organic molecule
Emp. Form.:
C32H31F3N8O5
Mol. Mass.:
664.6343
SMILES:
Oc1cccnc1C(=O)N1CCN(CC1)c1c(C2CC2)n(CC(=O)Nc2ccc(cc2)C(F)(F)F)c2nc(nn2c1=O)C1=CCOCC1
: