Target
Bromodomain-containing protein 2 [91-163]
Ligand
BDBM50092341
Substrate
Meas. Tech.
Biolayer Interferometry (BLI) Binding Assay
pH
7.4±n/a
Kd
34±2.10 nM
Comments
extracted
Citation
 Wang, SRan, XZhao, YYang, CLiu, LBai, LMcEachern, DStuckey, JMeagher, JLSun, DLi, XZhou, BKaratas, HLuo, RChinnaiyan, AAsangani, IA BET bromodomain inhibitors and therapeutic methods using the same US Patent  US9675697 Publication Date 6/13/2017 
Target
Name:
Bromodomain-containing protein 2 [91-163]
Synonyms:
BRD2 Bromodomain-containing protein 2 (BRD2)(BD1) KIAA9001 | RING3
Type:
Mol. Mass.:
8836.08
Organism:
Homo sapiens (Human)
Description:
BD1 (91-163 aa) of P25440
Residue:
73
  
Inhibitor
Name:
BDBM50092341
Synonyms:
CHEMBL3581660 | US9675697, Cpd. No. 22
Type:
Small organic molecule
Emp. Form.:
C24H25N5O2
Mol. Mass.:
415.4876
SMILES:
CCc1n[nH]c(CC)c1-c1nccc2[nH]c3cc(-c4c(C)noc4C)c(OC)cc3c12
: