Target
Bromodomain-containing protein 2 [91-163]
Ligand
BDBM179477
Substrate
Meas. Tech.
Biolayer Interferometry (BLI) Binding Assay
pH
7.4±n/a
Kd
34±8.20 nM
Comments
extracted
Citation
 Wang, SRan, XZhao, YYang, CLiu, LBai, LMcEachern, DStuckey, JMeagher, JLSun, DLi, XZhou, BKaratas, HLuo, RChinnaiyan, AAsangani, IA BET bromodomain inhibitors and therapeutic methods using the same US Patent  US9675697 Publication Date 6/13/2017 
Target
Name:
Bromodomain-containing protein 2 [91-163]
Synonyms:
BRD2 Bromodomain-containing protein 2 (BRD2)(BD1) KIAA9001 | RING3
Type:
Mol. Mass.:
8836.08
Organism:
Homo sapiens (Human)
Description:
BD1 (91-163 aa) of P25440
Residue:
73
  
Inhibitor
Name:
BDBM179477
Synonyms:
US9675697, Cpd. No. 44
Type:
Small organic molecule
Emp. Form.:
C26H22N4O2
Mol. Mass.:
422.4785
SMILES:
COc1cc2c(cc1-c1c(C)noc1C)[nH]c1ccnc(-c3c(C)[nH]c4ccccc34)c21
: