Target
Caspase-3
Ligand
BDBM10264
Substrate
Caspase-3 Substrate
Meas. Tech.
Caspase Inhibition Assay
IC50
40±n/a nM
Citation
 Chen, YHZhang, YHZhang, HJLiu, DZGu, MLi, JYWu, FZhu, XZLi, JNan, FJ Design, synthesis, and biological evaluation of isoquinoline-1,3,4-trione derivatives as potent caspase-3 inhibitors. J Med Chem 49:1613-23 (2006)  
Target
Name:
Caspase-3
Synonyms:
Apopain CASP3 CPP-32 Caspase 3 Caspase-3 subunit p17 SCA-1 Yama protein | caspase-3 preproprotein
Type:
Hydrolase; heterotetramer of two heterodimers
Mol. Mass.:
31607.55
Organism:
Homo sapiens (Human)
Description:
Residue:
277
  
Inhibitor
Name:
BDBM10264
Synonyms:
2-oxo-1-phenyl-2-[(1,3,4-trioxo-1,2,3,4-tetrahydroisoquinolin-5-yl)amino]ethyl acetate phenyl[(1,3,4-trioxo-1,2,3,4-tetrahydroisoquinolin-5-yl)carbamoyl]methyl acetate
Type:
Small organic molecule
Emp. Form.:
C19H14N2O6
Mol. Mass.:
366.3243
SMILES:
CC(=O)OC(C(=O)Nc1cccc2C(=O)NC(=O)C(=O)c12)c1ccccc1
:
Substrate
Name:
Caspase-3 Substrate
Synonyms:
Caspase-3 Substrate (Chromogenic)
Type:
Mol. Mass.:
1438.65
Organism:
Description:
pNA=p-Nitroaniline
Residue:
16
ACASPGLVALASPPNA