Target
Abscisic acid receptor PYL2/Protein phosphatase 2C 16
Ligand
BDBM313213
Substrate
Meas. Tech.
PP2C Activity Assay
IC50
244±n/a nM
Citation
 Loiseleur, OWendeborn, SVCutler, SR 2-oxo-3,4-dihydroquinolin-6-yl sulphonamide CPDS and their use as plant growth regulators US Patent  US10167261 Publication Date 1/1/2019 
Target
Name:
Abscisic acid receptor PYL2/Protein phosphatase 2C 16
Synonyms:
PYR2-HAB1
Type:
Protein
Mol. Mass.:
Description:
Components:
This complex has 2 components.
Component 1
Name:
Protein phosphatase 2C 16
Synonyms:
AtP2C-HA HAB1 P2C16_ARATH Protein HYPERSENSITIVE TO ABA 1 | Protein phosphatase 2C HAB1
Type:
Enzyme Catalytic Domain
Mol. Mass.:
55716.72
Organism:
Arabidopsis thaliana (Mouse-ear cress)
Description:
Residue:
511
  
Component 2
Name:
Abscisic acid receptor PYL2
Synonyms:
PYL2 PYR1-like protein 2 Regulatory components of ABA receptor 14
Type:
Enzyme Catalytic Domain
Mol. Mass.:
21277.66
Organism:
Arabidopsis thaliana (Mouse-ear cress)
Description:
Residue:
190
  
Inhibitor
Name:
BDBM313213
Synonyms:
1-(4-cyclopropylphenyl)-N-(1-ethyl-8-fluoro-2-oxo-3,4-dihydroquinolin-6-yl)methanesulfonamide | US10167261, Compound 1.213
Type:
Small organic molecule
Emp. Form.:
C21H23FN2O3S
Mol. Mass.:
402.482
SMILES:
CCN1C(=O)CCc2cc(NS(=O)(=O)Cc3ccc(cc3)C3CC3)cc(F)c12
: