Target
Caspase-8
Ligand
BDBM10354
Substrate
Caspase-8 Fluorogenic Substrate
Meas. Tech.
Caspase Inhibition Assay
IC50
>50000±n/a nM
Citation
 Chu, WZhang, JZeng, CRothfuss, JTu, ZChu, YReichert, DEWelch, MJMach, RH N-benzylisatin sulfonamide analogues as potent caspase-3 inhibitors: synthesis, in vitro activity, and molecular modeling studies. J Med Chem 48:7637-47 (2005)  
Target
Name:
Caspase-8
Synonyms:
Apoptotic cysteine protease CAP4 CASP8 Caspase Caspase-8 subunit p18 FADD-like ICE ICE-like apoptotic protease 5 MCH5 | MORT1-associated CED-3 homolog
Type:
Enzyme
Mol. Mass.:
55373.89
Organism:
Homo sapiens (Human)
Description:
Q14790
Residue:
479
  
Inhibitor
Name:
BDBM10354
Synonyms:
5-(2-(Pyridin-4-yl-oxymethyl)-pyrrolidine-1-sulfonyl)-1H-indole-2,3-dione Pyridine Analogue 23
Type:
Small organic molecule
Emp. Form.:
C18H17N3O5S
Mol. Mass.:
387.41
SMILES:
O=C1Nc2ccc(cc2C1=O)S(=O)(=O)N1CCC[C@H]1COc1ccncc1
:
Substrate
Name:
Caspase-8 Fluorogenic Substrate
Synonyms:
Ac-IETD-AMC
Type:
Peptide
Mol. Mass.:
1673.49
Organism:
Description:
AMC=7-Amino-4-methylcoumarin
Residue:
16
ACILEGLTHRASPAMC