Target
Integrin alpha-4/beta-7
Ligand
BDBM314067
Substrate
Meas. Tech.
ELISA assay
IC50
0.270±n/a nM
Citation
 Vinnik, AFedichev, PKholin, MMolloy, CKatz, AKadushkin, A Compounds for the treatment and prevention of retroviral infections US Patent  US9610264 Publication Date 4/4/2017 
Target
Name:
Integrin alpha-4/beta-7
Synonyms:
Integrin α4β7 Integrin alpha-4/beta7 | Integrin alpha4beta7
Type:
Protein Complex
Mol. Mass.:
Description:
The assay uses stably transfected K562 cells expressing human alpha4beta7 integrin.
Components:
This complex has 2 components.
Component 1
Name:
Integrin alpha-4
Synonyms:
CD49 antigen-like family member D CD49d antigen ITA4_HUMAN Integrin alpha-4 Integrin alpha-IV VLA-4 integrin alpha 4 precursor | integrin alpha-4 precursor
Type:
Membrane Protein
Mol. Mass.:
114897.35
Organism:
Homo sapiens (Human)
Description:
P13612
Residue:
1032
  
Component 2
Name:
Integrin beta-7
Synonyms:
ITB7_HUMAN Integrin alpha-4/beta-7 Integrin beta7
Type:
Membrane Protein
Mol. Mass.:
86893.88
Organism:
Homo sapiens (Human)
Description:
P26010
Residue:
798
  
Inhibitor
Name:
BDBM314067
Synonyms:
US9610264, Compound 4
Type:
Small organic molecule
Emp. Form.:
C25H28N4O2S
Mol. Mass.:
448.58
SMILES:
O=C(CN1CCN(Cc2ccsc2)CC1)Nc1ccccc1C(=O)NCc1ccccc1
: