Target
Lysine-specific demethylase 4C
Ligand
BDBM314122
Substrate
Meas. Tech.
Enzymatic Assay
IC50
550±n/a nM
Citation
 Chen, YKKanouni, TNie, ZStafford, JAVeal, JMWallace, MB Histone demethylase inhibitors US Patent  US9611221 Publication Date 4/4/2017 
Target
Name:
Lysine-specific demethylase 4C
Synonyms:
GASC-1 protein Gene amplified in squamous cell carcinoma 1 protein JMJD2C Jumonji domain-containing protein 2C KDM4C_HUMAN | KIAA0780
Type:
Protein
Mol. Mass.:
119979.01
Organism:
Homo sapiens (Human)
Description:
Q9H3R0
Residue:
1056
  
Inhibitor
Name:
BDBM314122
Synonyms:
3-[(4-chloro-2-cyclopropylbenzyl)amino]pyridine-4-carboxylic acid US10807956, Example 26 US11639333, Example 26 US9725441, Example 26 | US9828343, Example 26
Type:
Small organic molecule
Emp. Form.:
C16H15ClN2O2
Mol. Mass.:
302.756
SMILES:
OC(=O)c1ccncc1NCc1ccc(Cl)cc1C1CC1
: