Target
Orexin/Hypocretin receptor type 1
Ligand
BDBM143749
Substrate
Meas. Tech.
Radioligand Binding Assay
Ki
18.0±n/a nM
Citation
 Gelin, CFLebold, TPShireman, BTZiff, JM Substituted 2-azabicycles and their use as orexin receptor modulators US Patent  US9611277 Publication Date 4/4/2017 
Target
Name:
Orexin/Hypocretin receptor type 1
Synonyms:
Hcrtr1 OX1R_RAT Orexin receptor type 1 (OX1R) Ox1-R | Ox1R
Type:
Protein
Mol. Mass.:
46817.55
Organism:
Rattus norvegicus (Rat)
Description:
P56718
Residue:
416
  
Inhibitor
Name:
BDBM143749
Synonyms:
US10183953, Example 10 US9611277, Example 10 | US9845333, 10
Type:
Small organic molecule
Emp. Form.:
C24H22F3N3O3
Mol. Mass.:
457.445
SMILES:
CCOc1ccc2cccnc2c1C(=O)N1CC2CC(Oc3ccc(cn3)C(F)(F)F)C1C2
: