Target
Carbonic anhydrase 1
Ligand
BDBM315269
Substrate
Meas. Tech.
Known Inhibitors of Carbonic Anhydrase
IC50
14.0±n/a nM
Citation
 Collier, GRWalder, KRCampbell, JAMolero-Navajas, JKonstantopoulos, NKrippner, GY Insulin sensitisers and methods of treatment US Patent  US10172837 Publication Date 1/8/2019 
Target
Name:
Carbonic anhydrase 1
Synonyms:
CA-I CAB Carbonate dehydratase I Carbonic anhydrase 1 (CA I) Carbonic anhydrase 1 (Recombinant CA I) Carbonic anhydrase B Carbonic anhydrase I (CA I) Carbonic anhydrase I (CAI) Carbonic anhydrase isoenzyme I (hCA I) | hCA
Type:
Enzyme
Mol. Mass.:
28873.37
Organism:
Homo sapiens (Human)
Description:
P00915
Residue:
261
  
Inhibitor
Name:
BDBM315269
Synonyms:
US10172837, Methazolamide
Type:
Small organic molecule
Emp. Form.:
C5H8N4O3S2
Mol. Mass.:
236.272
SMILES:
CC(=O)\N=c1/sc(nn1C)S(N)(=O)=O
: