Target
Carbonic anhydrase 1
Ligand
BDBM50043906
Substrate
Meas. Tech.
Known Inhibitors of Carbonic Anhydrase
IC50
9.00±n/a nM
Citation
 Collier, GRWalder, KRCampbell, JAMolero-Navajas, JKonstantopoulos, NKrippner, GY Insulin sensitisers and methods of treatment US Patent  US10172837 Publication Date 1/8/2019 
Target
Name:
Carbonic anhydrase 1
Synonyms:
CA-I CAB Carbonate dehydratase I Carbonic anhydrase 1 (CA I) Carbonic anhydrase 1 (Recombinant CA I) Carbonic anhydrase B Carbonic anhydrase I (CA I) Carbonic anhydrase I (CAI) Carbonic anhydrase isoenzyme I (hCA I) | hCA
Type:
Enzyme
Mol. Mass.:
28873.37
Organism:
Homo sapiens (Human)
Description:
P00915
Residue:
261
  
Inhibitor
Name:
BDBM50043906
Synonyms:
CHEMBL269001 MK-507 | US10172837, Dorzolamide
Type:
Small organic molecule
Emp. Form.:
C10H16N2O4S3
Mol. Mass.:
324.44
SMILES:
CCNC1CC(C)S(=O)(=O)c2sc(cc12)S(N)(=O)=O
: