Target
Histone deacetylase 4
Ligand
BDBM293880
Substrate
Meas. Tech.
Inhibition Assay
IC50
10.00±n/a nM
Citation
 Dominguez, CMuñoz-Sanjuán, IMaillard, MLuckhurst, CAJarvis, REBürli, RWAllen, DRHaughan, AFBreccia, PVater, HDStott, AJPenrose, SDWall, MSaville-Stones, EAWishart, GHughes, SJ Histone deacetylase inhibitors and compositions and methods of use thereof US Patent  US9617259 Publication Date 4/11/2017 
Target
Name:
Histone deacetylase 4
Synonyms:
Cereblon/Histone deacetylase 4 HDAC4 Histone acetylase 4(HDAC4) KIAA0288
Type:
Enzyme
Mol. Mass.:
119049.39
Organism:
Homo sapiens (Human)
Description:
P56524
Residue:
1084
  
Inhibitor
Name:
BDBM293880
Synonyms:
(S)-1-(3-Fluoro-2- methylphenyl)-3-(5- fluoropyridin-3-yl)-N- hydroxycyclopent-2- enecarboxamide US9617259, 6
Type:
Small organic molecule
Emp. Form.:
C18H16F2N2O2
Mol. Mass.:
330.3286
SMILES:
Cc1c(F)cccc1[C@@]1(CCC(=C1)c1cncc(F)c1)C(=O)NO
: