Target
Histone deacetylase 4
Ligand
BDBM293882
Substrate
Meas. Tech.
Inhibition Assay
IC50
2400±n/a nM
Citation
 Dominguez, CMuñoz-Sanjuán, IMaillard, MLuckhurst, CAJarvis, REBürli, RWAllen, DRHaughan, AFBreccia, PVater, HDStott, AJPenrose, SDWall, MSaville-Stones, EAWishart, GHughes, SJ Histone deacetylase inhibitors and compositions and methods of use thereof US Patent  US9617259 Publication Date 4/11/2017 
Target
Name:
Histone deacetylase 4
Synonyms:
Cereblon/Histone deacetylase 4 HDAC4 Histone acetylase 4(HDAC4) KIAA0288
Type:
Enzyme
Mol. Mass.:
119049.39
Organism:
Homo sapiens (Human)
Description:
P56524
Residue:
1084
  
Inhibitor
Name:
BDBM293882
Synonyms:
(S)-1-(3-Fluoro-2- methylphenyl)-N- hydroxy-3-(pyrazin-2- yl)cyclopent-2- enecarboxamide US9617259, 8
Type:
Small organic molecule
Emp. Form.:
C17H16FN3O2
Mol. Mass.:
313.3262
SMILES:
Cc1c(F)cccc1[C@@]1(CCC(=C1)c1cnccn1)C(=O)NO
: