Target
CARBONIC ANHYDRASE
Ligand
BDBM10864
Substrate
BDBM10856
Meas. Tech.
CA Inhibition Assay
Ki
452±n/a nM
Citation
 Nishimori, IMinakuchi, TMorimoto, KSano, SOnishi, STakeuchi, HVullo, DScozzafava, ASupuran, CT Carbonic anhydrase inhibitors: DNA cloning and inhibition studies of the alpha-carbonic anhydrase from Helicobacter pylori, a new target for developing sulfonamide and sulfamate gastric drugs. J Med Chem 49:2117-26 (2006)  
Target
Name:
CARBONIC ANHYDRASE
Synonyms:
Carbonic Anhydrase (hpCA) | hpCA
Type:
Enzyme
Mol. Mass.:
28277.52
Organism:
Helicobacter pylori J99
Description:
Q9ZK30
Residue:
247
  
Inhibitor
Name:
BDBM10864
Synonyms:
4-Amino-3-bromobenzenesulfonamide CHEMBL6724 halogenosulfanilamide deriv. 5d
Type:
Small organic molecule
Emp. Form.:
C6H7BrN2O2S
Mol. Mass.:
251.101
SMILES:
Nc1ccc(cc1Br)S(N)(=O)=O
:
Substrate
Name:
BDBM10856
Synonyms:
Carbon Dioxide | methanedione
Type:
Small organic molecule
Emp. Form.:
CO2
Mol. Mass.:
44.0095
SMILES:
O=C=O
: