Target
CARBONIC ANHYDRASE
Ligand
BDBM10901
Substrate
BDBM10856
Meas. Tech.
CA Inhibition Assay
Ki
27±n/a nM
Citation
 Nishimori, IMinakuchi, TMorimoto, KSano, SOnishi, STakeuchi, HVullo, DScozzafava, ASupuran, CT Carbonic anhydrase inhibitors: DNA cloning and inhibition studies of the alpha-carbonic anhydrase from Helicobacter pylori, a new target for developing sulfonamide and sulfamate gastric drugs. J Med Chem 49:2117-26 (2006)  
Target
Name:
CARBONIC ANHYDRASE
Synonyms:
Carbonic Anhydrase (hpCA) | hpCA
Type:
Enzyme
Mol. Mass.:
28277.52
Organism:
Helicobacter pylori J99
Description:
Q9ZK30
Residue:
247
  
Inhibitor
Name:
BDBM10901
Synonyms:
4-(4-tert-Butylphenylsulfonamidoethyl)benzenesulfonamide aromatic/heteroaromatic sulfonamide 35
Type:
Small organic molecule
Emp. Form.:
C18H24N2O4S2
Mol. Mass.:
396.524
SMILES:
CC(C)(C)c1ccc(cc1)S(=O)(=O)NCCc1ccc(cc1)S(N)(=O)=O
:
Substrate
Name:
BDBM10856
Synonyms:
Carbon Dioxide | methanedione
Type:
Small organic molecule
Emp. Form.:
CO2
Mol. Mass.:
44.0095
SMILES:
O=C=O
: