Target
Phosphatidylinositol 3-kinase regulatory subunit alpha
Ligand
BDBM318958
Substrate
Meas. Tech.
Biological Assay for PI3K alpha
IC50
0.4±0 nM
Citation
 Zhang, D Pyridine compounds used as PI3 kinase inhibitors US Patent  US10173995 Publication Date 1/8/2019 
Target
Name:
Phosphatidylinositol 3-kinase regulatory subunit alpha
Synonyms:
GRB1 PI3-kinase class I PI3-kinase p85-alpha subunit PI3-kinase subunit p85-alpha PIK3CG/PIK3R1 Phosphatidylinositol 3-kinase 85 kDa regulatory subunit alpha (PI3K alpha) Phosphatidylinositol 3-kinase regulatory subunit alpha (PIK3R1) Phosphatidylinositol 3-kinase regulatory subunit alpha isoform 1 (PI3 Kinase alpha) Phosphatidylinositol 4,5-bisphosphate 3-kinase catalytic subunit alpha isoform (PI3Kalpha) PtdIns-3-kinase p85-alpha p85 alpha
Type:
Protein
Mol. Mass.:
83592.82
Organism:
Homo sapiens (Human)
Description:
P27986
Residue:
724
  
Inhibitor
Name:
BDBM318958
Synonyms:
N-(5-(2,6-dimorpholinopyrimidin-4-yl)-4-(trifluoromethyl)pyridin-2-yl)acetamide | US10173995, Compound 2
Type:
Small organic molecule
Emp. Form.:
C20H23F3N6O3
Mol. Mass.:
452.4302
SMILES:
CC(=O)Nc1cc(c(cn1)-c1cc(nc(n1)N1CCOCC1)N1CCOCC1)C(F)(F)F
: