Target
Carbonic anhydrase 1
Ligand
BDBM11364
Substrate
BDBM11326
Meas. Tech.
Carbonic Anhydrase Enzyme Inhibition Assay
Ki
>200±n/a nM
Citation
 Scozzafava, ASupuran, CT Carbonic anhydrase and matrix metalloproteinase inhibitors: sulfonylated amino acid hydroxamates with MMP inhibitory properties act as efficient inhibitors of CA isozymes I, II, and IV, and N-hydroxysulfonamides inhibit both these zinc enzymes. J Med Chem 43:3677-87 (2000)  
Target
Name:
Carbonic anhydrase 1
Synonyms:
CA-I CAB Carbonate dehydratase I Carbonic anhydrase 1 (CA I) Carbonic anhydrase 1 (Recombinant CA I) Carbonic anhydrase B Carbonic anhydrase I (CA I) Carbonic anhydrase I (CAI) Carbonic anhydrase isoenzyme I (hCA I) | hCA
Type:
Enzyme
Mol. Mass.:
28873.37
Organism:
Homo sapiens (Human)
Description:
P00915
Residue:
261
  
Inhibitor
Name:
BDBM11364
Synonyms:
2-{[(2-chlorophenyl)methyl](4-methoxybenzene)sulfonamido}-N-hydroxypropanamide hydroxamate deriv. B24
Type:
Small organic molecule
Emp. Form.:
C17H19ClN2O5S
Mol. Mass.:
398.861
SMILES:
COc1ccc(cc1)S(=O)(=O)N(Cc1ccccc1Cl)C(C)C(=O)NO
:
Substrate
Name:
BDBM11326
Synonyms:
4-nitrophenyl acetate | p-Nitrophenyl Acetate
Type:
Small organic molecule
Emp. Form.:
C8H7NO4
Mol. Mass.:
181.1455
SMILES:
CC(=O)Oc1ccc(cc1)[N+]([O-])=O
: