Target
Tyrosine-protein kinase SYK
Ligand
BDBM189857
Substrate
Meas. Tech.
Time-Resolved Fluorescence (HTRF) Assay
pH
7.5±n/a
Temperature
298.15±n/a K
IC50
16.98±0.0 nM
Comments
extracted
Citation
 Miller, TAPetrocchi, ARomeo, ETVitharana, DKattar, SDNorthrup, ABAltman, MDAnthony, NJ Thiazole-substituted aminoheteroaryls as Spleen Tyrosine Kinase inhibitors US Patent  US9670196 Publication Date 6/6/2017 
Target
Name:
Tyrosine-protein kinase SYK
Synonyms:
KSYK_HUMAN Spleen Tyrosine Kinase Tyrosine-protein kinase SYK (Syk)
Type:
Enzyme
Mol. Mass.:
72079.99
Organism:
Homo sapiens (Human)
Description:
P43405
Residue:
635
  
Inhibitor
Name:
BDBM189857
Synonyms:
US9670196, 1.2 (1S,4R or 1R,4S)-4-(5-(3-((6,7-dihydro-5H-cyclopenta[d]pyrimidin-2-yl)amino)-5-methylphenyl)thiazol-2-yl)-4-hydroxy-2,2-dimethylcyclohexanecarboxylic acid
Type:
Small organic molecule
Emp. Form.:
C26H30N4O3S
Mol. Mass.:
478.606
SMILES:
Cc1cc(Nc2ncc3CCCc3n2)cc(c1)-c1cnc(s1)[C@@]1(O)CC[C@H](C(O)=O)C(C)(C)C1
: