Target
Tyrosine-protein kinase SYK
Ligand
BDBM189864
Substrate
Meas. Tech.
Time-Resolved Fluorescence (HTRF) Assay
pH
7.5±n/a
Temperature
298.15±n/a K
IC50
2.44±0.0 nM
Comments
extracted
Citation
 Miller, TAPetrocchi, ARomeo, ETVitharana, DKattar, SDNorthrup, ABAltman, MDAnthony, NJ Thiazole-substituted aminoheteroaryls as Spleen Tyrosine Kinase inhibitors US Patent  US9670196 Publication Date 6/6/2017 
Target
Name:
Tyrosine-protein kinase SYK
Synonyms:
KSYK_HUMAN Spleen Tyrosine Kinase Tyrosine-protein kinase SYK (Syk)
Type:
Enzyme
Mol. Mass.:
72079.99
Organism:
Homo sapiens (Human)
Description:
P43405
Residue:
635
  
Inhibitor
Name:
BDBM189864
Synonyms:
US9670196, 2.1 4-((5-(3-([1,2,4]triazolo[1,5-a]pyridin-2-ylamino)-5-methylphenyl)thiazol-2-yl)methyl)benzoic acid
Type:
Small organic molecule
Emp. Form.:
C24H19N5O2S
Mol. Mass.:
441.505
SMILES:
Cc1cc(Nc2nc3ccccn3n2)cc(c1)-c1cnc(Cc2ccc(cc2)C(O)=O)s1
: